BDBM61507 (Z)-2-(Morpholine-4-carbonyl)-3-[1-phenyl-3-(4-propylsulfanyl-phenyl)-1H-pyrazol-4-yl]-acrylonitrile::(Z)-2-(morpholine-4-carbonyl)-3-[1-phenyl-3-(4-propylsulfanylphenyl)pyrazol-4-yl]prop-2-enenitrile::(Z)-2-(morpholine-4-carbonyl)-3-[1-phenyl-3-[4-(propylthio)phenyl]pyrazol-4-yl]acrylonitrile::(Z)-2-[4-morpholinyl(oxo)methyl]-3-[1-phenyl-3-[4-(propylthio)phenyl]-4-pyrazolyl]-2-propenenitrile::(Z)-2-morpholin-4-ylcarbonyl-3-[1-phenyl-3-(4-propylsulfanylphenyl)pyrazol-4-yl]prop-2-enenitrile::MLS000590161::SMR000219377::cid_1874996
SMILES CCCSc1ccc(cc1)-c1nn(cc1\C=C(\C#N)C(=O)N1CCOCC1)-c1ccccc1
InChI Key InChIKey=GGETULYJKSLRDT-FXBPSFAMSA-N
Data  1 IC50
  Tab Delimited (TSV)   2D SDfile   Computed 3D by Vconf -m prep SDfile
Find this compound or compounds like it in BindingDB:
Activity Spreadsheet -- Enzyme Inhibition Constant Data from BindingDB
Found 1 hit for monomerid = 61507
TargetG-protein coupled receptor 55(Homo sapiens (Human))
Burnham Center For Chemical Genomics
Curated by PubChem BioAssay
LigandPNGBDBM61507((Z)-2-(Morpholine-4-carbonyl)-3-[1-phenyl-3-(4-pro...)
Affinity DataIC50:  500nM. Assay description: Data Source: Sanford-Burnham Center for Chemical Genomics (SBCCG) Source Affiliation: Sanford-Burnham Medical Research Institute (SBMRI, San Diego, C...
In DepthDetails PCBioAssay